BDBM50157172 2-{Cyclohexyl-[4-(thiophen-2-ylmethoxy)-benzoyl]-amino}-thiazole-5-carboxylic acid::CHEMBL361163
SMILES OC(=O)c1cnc(s1)N(C1CCCCC1)C(=O)c1ccc(OCc2cccs2)cc1
InChI Key InChIKey=OBXHZZGQCJDWCP-UHFFFAOYSA-N
Data  1 IC50
  Tab Delimited (TSV)   2D SDfile   Computed 3D by Vconf -m prep SDfile
Find this compound or compounds like it in BindingDB:
Activity Spreadsheet -- Enzyme Inhibition Constant Data from BindingDB
Found 1 hit for monomerid = 50157172
TargetRNA-directed RNA polymerase(Hepatitis C virus)
Neogenesis Pharmaceuticals
Curated by ChEMBL
LigandPNGBDBM50157172(2-{Cyclohexyl-[4-(thiophen-2-ylmethoxy)-benzoyl]-a...)
Affinity DataIC50:  7.00E+3nM. Assay description: Inhibitory concentration against RNA dependent RNA polymerase nonstructural protein 5B of hepatitis C virus
In DepthDetails ArticlePubMed