BDBM50157177 2-{Cyclohexyl-[4-(3-trifluoromethyl-phenoxy)-benzoyl]-amino}-thiazole-5-carboxylic acid::CHEMBL180837
SMILES OC(=O)c1cnc(s1)N(C1CCCCC1)C(=O)c1ccc(Oc2cccc(c2)C(F)(F)F)cc1
InChI Key InChIKey=KIBZGTMTFZKSRF-UHFFFAOYSA-N
Data  1 IC50
  Tab Delimited (TSV)   2D SDfile   Computed 3D by Vconf -m prep SDfile
Find this compound or compounds like it in BindingDB:
Activity Spreadsheet -- Enzyme Inhibition Constant Data from BindingDB
Found 1 hit for monomerid = 50157177
TargetRNA-directed RNA polymerase(Hepatitis C virus)
Neogenesis Pharmaceuticals
Curated by ChEMBL
LigandPNGBDBM50157177(2-{Cyclohexyl-[4-(3-trifluoromethyl-phenoxy)-benzo...)
Affinity DataIC50:  4.40E+3nM. Assay description: Inhibitory concentration against RNA dependent RNA polymerase nonstructural protein 5B of hepatitis C virus
In DepthDetails ArticlePubMed