BDBM50157274 2''-Methyl-5-[(2-methyl-benzyloxy)-(3-methyl-3H-imidazol-4-yl)-methyl]-biphenyl-2-carbonitrile::CHEMBL360229
SMILES Cc1ccccc1COC(c1cncn1C)c1ccc(C#N)c(c1)-c1ccccc1C
InChI Key InChIKey=OSUJGMDXLAQUFC-UHFFFAOYSA-N
Data  1 IC50
  Tab Delimited (TSV)   2D SDfile   Computed 3D by Vconf -m prep SDfile
Find this compound or compounds like it in BindingDB:
Activity Spreadsheet -- Enzyme Inhibition Constant Data from BindingDB
Found 1 hit for monomerid = 50157274
LigandPNGBDBM50157274(2''-Methyl-5-[(2-methyl-benzyloxy)-(3-methyl-3H-im...)
Affinity DataIC50:  54nM. Assay description: Inhibition of Bovine farnesyl transeferase
In DepthDetails ArticlePubMed