BDBM50157278 2''-Methyl-5-[(3-methyl-3H-imidazol-4-yl)-(naphthalen-1-ylmethoxy)-methyl]-biphenyl-2-carbonitrile::CHEMBL182389
SMILES Cc1ccccc1-c1cc(ccc1C#N)C(OCc1cccc2ccccc12)c1cncn1C
InChI Key InChIKey=VUGCVJYZZQMGEQ-UHFFFAOYSA-N
Data  1 IC50
  Tab Delimited (TSV)   2D SDfile   Computed 3D by Vconf -m prep SDfile
Find this compound or compounds like it in BindingDB:
Activity Spreadsheet -- Enzyme Inhibition Constant Data from BindingDB
Found 1 hit for monomerid = 50157278
LigandPNGBDBM50157278(2''-Methyl-5-[(3-methyl-3H-imidazol-4-yl)-(naphtha...)
Affinity DataIC50:  17nM. Assay description: Inhibition of Bovine farnesyl transeferase
In DepthDetails ArticlePubMed