BDBM50157293 5-[(Biphenyl-4-ylmethoxy)-(3-methyl-3H-imidazol-4-yl)-methyl]-2''-methyl-biphenyl-2-carbonitrile::CHEMBL183480
SMILES Cc1ccccc1-c1cc(ccc1C#N)C(OCc1ccc(cc1)-c1ccccc1)c1cncn1C
InChI Key InChIKey=JLQFXAIOFXEXRU-UHFFFAOYSA-N
Data  1 IC50
  Tab Delimited (TSV)   2D SDfile   Computed 3D by Vconf -m prep SDfile
Find this compound or compounds like it in BindingDB:
Activity Spreadsheet -- Enzyme Inhibition Constant Data from BindingDB
Found 1 hit for monomerid = 50157293
LigandPNGBDBM50157293(5-[(Biphenyl-4-ylmethoxy)-(3-methyl-3H-imidazol-4-...)
Affinity DataIC50:  13nM. Assay description: Inhibition of Bovine farnesyl transeferase
In DepthDetails ArticlePubMed