BDBM50157336 CHEMBL3785093
SMILES COc1cc2CC\C(=N/NC(N)=N)C(C)(C)c2cc1Nc1ncc(Cl)c(Nc2ccccc2S(=O)(=O)C(C)C)n1
InChI Key InChIKey=UHUZMOLBOOQOEK-UHFFFAOYSA-N
Data  2 IC50
  Tab Delimited (TSV)   2D SDfile   Computed 3D by Vconf -m prep SDfile
Find this compound or compounds like it in BindingDB:
Activity Spreadsheet -- Enzyme Inhibition Constant Data from BindingDB
Found 2 hits for monomerid = 50157336
TargetALK tyrosine kinase receptor(Homo sapiens (Human))
Chungbuk National University
Curated by ChEMBL
LigandPNGBDBM50157336(CHEMBL3785093)
Affinity DataIC50:  100nM. Assay description: Inhibition of ALK L1196M mutant (unknown origin) after 30 mins by HTRF assay
In DepthDetails ArticlePubMed
TargetALK tyrosine kinase receptor(Homo sapiens (Human))
Chungbuk National University
Curated by ChEMBL
LigandPNGBDBM50157336(CHEMBL3785093)
Affinity DataIC50:  16nM. Assay description: Inhibition of wild type ALK (unknown origin) after 30 mins by HTRF assay
In DepthDetails ArticlePubMed