BDBM50158461 (2,6-dichloropyridin-4-yl)(2-ethylbenzofuran-3-yl)methanone::CHEMBL224830
SMILES CCc1oc2ccccc2c1C(=O)c1cc(Cl)nc(Cl)c1
InChI Key InChIKey=ZCILOHLPICXOCO-UHFFFAOYSA-N
Data  1 KI
  Tab Delimited (TSV)   2D SDfile   Computed 3D by Vconf -m prep SDfile
Find this compound or compounds like it in BindingDB:
Activity Spreadsheet -- Enzyme Inhibition Constant Data from BindingDB
Found 1 hit for monomerid = 50158461
TargetCytochrome P450 2C19(Homo sapiens (Human))
Washington State University
Curated by ChEMBL
LigandPNGBDBM50158461((2,6-dichloropyridin-4-yl)(2-ethylbenzofuran-3-yl)...)
Affinity DataKi:  1.30E+4nM. Assay description: Inhibition of human CYP2C19
In DepthDetails ArticlePubMed