BDBM50158588 (3,5-Difluoro-phenyl)-{2-[2-((R)-2-methyl-pyrrolidin-1-yl)-ethyl]-benzofuran-5-yl}-methanone::CHEMBL178682
SMILES C[C@@H]1CCCN1CCc1cc2cc(ccc2o1)C(=O)c1cc(F)cc(F)c1
InChI Key InChIKey=JSFFTMNTWAMSKS-CQSZACIVSA-N
Data  2 KI
  Tab Delimited (TSV)   2D SDfile   Computed 3D by Vconf -m prep SDfile
Find this compound or compounds like it in BindingDB:
Activity Spreadsheet -- Enzyme Inhibition Constant Data from BindingDB
Found 2 hits for monomerid = 50158588
TargetHistamine H3 receptor(Homo sapiens (Human))
Abbott Laboratories
Curated by ChEMBL
LigandPNGBDBM50158588((3,5-Difluoro-phenyl)-{2-[2-((R)-2-methyl-pyrrolid...)
Affinity DataKi:  0.0900nM. Assay description: In vitro binding affinity was determined as displacement of [3H]N-R-methylhistamine from C6 cell membranes expressing human histamine H3 receptor
In DepthDetails ArticlePubMed
TargetHistamine H3 receptor(Rattus norvegicus (rat))
Abbott Laboratories
Curated by ChEMBL
LigandPNGBDBM50158588((3,5-Difluoro-phenyl)-{2-[2-((R)-2-methyl-pyrrolid...)
Affinity DataKi:  0.540nM. Assay description: In vitro binding affinity was determined as displacement of [3H]N-R-methylhistamine from C6 cell membranes expressing rat histamine H3 receptor
In DepthDetails ArticlePubMed