BDBM50158731 5-(3-Benzoyl-thioureido)-2-hydroxy-benzoic acid::CHEMBL361631
SMILES OC(=O)c1cc(NC(=S)NC(=O)c2ccccc2)ccc1O
InChI Key InChIKey=VSXWNCFSXXHNAN-UHFFFAOYSA-N
Data  2 IC50
  Tab Delimited (TSV)   2D SDfile   Computed 3D by Vconf -m prep SDfile
Find this compound or compounds like it in BindingDB:
Activity Spreadsheet -- Enzyme Inhibition Constant Data from BindingDB
Found 2 hits for monomerid = 50158731
TargetReverse transcriptase/RNaseH(Human immunodeficiency virus 1)
University Of Southern California
Curated by ChEMBL
LigandPNGBDBM50158731(5-(3-Benzoyl-thioureido)-2-hydroxy-benzoic acid | ...)
Affinity DataIC50: >1.00E+5nM. Assay description: Inhibitory concentration against human immuno deficiency virus type 1 integrase (3'-processing)
In DepthDetails ArticlePubMed
TargetReverse transcriptase/RNaseH(Human immunodeficiency virus 1)
University Of Southern California
Curated by ChEMBL
LigandPNGBDBM50158731(5-(3-Benzoyl-thioureido)-2-hydroxy-benzoic acid | ...)
Affinity DataIC50: >1.00E+5nM. Assay description: Inhibitory concentration against human immuno deficiency virus type 1 integrase (Strand Transfer)
In DepthDetails ArticlePubMed