BDBM50162695 3-[5-(2-Trifluoromethyl-benzoyl)-thiazol-2-ylamino]-benzonitrile::CHEMBL369763
SMILES FC(F)(F)c1ccccc1C(=O)c1cnc(Nc2cccc(c2)C#N)s1
InChI Key InChIKey=RBQKYBPWMXOKNC-UHFFFAOYSA-N
Data  1 IC50
  Tab Delimited (TSV)   2D SDfile   Computed 3D by Vconf -m prep SDfile
Find this compound or compounds like it in BindingDB:
Activity Spreadsheet -- Enzyme Inhibition Constant Data from BindingDB
Found 1 hit for monomerid = 50162695
TargetNeuropeptide Y receptor type 5(Mus musculus (Mouse))
F. Hoffmann-La Roche
Curated by ChEMBL
LigandPNGBDBM50162695(3-[5-(2-Trifluoromethyl-benzoyl)-thiazol-2-ylamino...)
Affinity DataIC50:  20nM. Assay description: Inhibitory concentration against Neuropeptide Y receptor type 5 in mouse
In DepthDetails ArticlePubMed