BDBM50162738 1-Benzoyl-4-(4-but-2-ynyloxy-benzenesulfonyl)-[1,4]diazepane-5-carboxylic acid hydroxyamide::1-benzoyl-4-(4-(but-2-ynyloxy)phenylsulfonyl)-N-hydroxy-1,4-diazepane-5-carboxamide::CHEMBL369302
SMILES CC#CCOc1ccc(cc1)S(=O)(=O)N1CCN(CCC1C(=O)NO)C(=O)c1ccccc1
InChI Key InChIKey=CCGWFLCBYDXLBZ-UHFFFAOYSA-N
Data  4 IC50
  Tab Delimited (TSV)   2D SDfile   Computed 3D by Vconf -m prep SDfile
Find this compound or compounds like it in BindingDB:
Activity Spreadsheet -- Enzyme Inhibition Constant Data from BindingDB
Found 4 hits for monomerid = 50162738
TargetDisintegrin and metalloproteinase domain-containing protein 17(Homo sapiens (Human))
Wyeth Research
Curated by ChEMBL
LigandPNGBDBM50162738(1-Benzoyl-4-(4-but-2-ynyloxy-benzenesulfonyl)-[1,4...)
Affinity DataIC50:  10nM. Assay description: Inhibitory concentration against TNF-alpha converting enzyme at 1 uM
In DepthDetails ArticlePubMed
TargetCollagenase 3(Homo sapiens (Human))
Pomona College
Curated by ChEMBL
LigandPNGBDBM50162738(1-Benzoyl-4-(4-but-2-ynyloxy-benzenesulfonyl)-[1,4...)
Affinity DataIC50:  4nM. Assay description: Inhibition of MMP13
In DepthDetails ArticlePubMed
TargetInterstitial collagenase(Homo sapiens (Human))
Wyeth Research
Curated by ChEMBL
LigandPNGBDBM50162738(1-Benzoyl-4-(4-but-2-ynyloxy-benzenesulfonyl)-[1,4...)
Affinity DataIC50:  113nM. Assay description: Inhibitory concentration against matrix metalloproteinase-1 at 1 uM
In DepthDetails ArticlePubMed
TargetCollagenase 3(Homo sapiens (Human))
Pomona College
Curated by ChEMBL
LigandPNGBDBM50162738(1-Benzoyl-4-(4-but-2-ynyloxy-benzenesulfonyl)-[1,4...)
Affinity DataIC50:  4nM. Assay description: Inhibitory concentration against Matrix metalloproteinase-13 at 1 uM
In DepthDetails ArticlePubMed