BDBM50163786 CHEMBL3797656
SMILES CN1c2ccc(cc2CS1(=O)=O)-c1cnc(N)c(F)c1N1CCC2(CNC(=O)O2)CC1
InChI Key InChIKey=NCIRPZWSTPFOGW-UHFFFAOYSA-N
Data  1 IC50
  Tab Delimited (TSV)   2D SDfile   Computed 3D by Vconf -m prep SDfile
Find this compound or compounds like it in BindingDB:
Activity Spreadsheet -- Enzyme Inhibition Constant Data from BindingDB
Found 1 hit for monomerid = 50163786
TargetCyclin-dependent kinase 8(Homo sapiens (Human))
The Institute Of Cancer Research
Curated by ChEMBL
LigandPNGBDBM50163786(CHEMBL3797656)
Affinity DataIC50:  5.5nM. Assay description: Binding affinity to His-tagged CDK8 (unknown origin) after 60 mins by FRET based lanthascreen binding assay
In DepthDetails ArticlePubMed