BDBM50163847 CHEMBL3800307
SMILES Cn1cc(cn1)-c1ccc(cc1)-c1cncc(F)c1N1CCC2(CNC(=O)O2)CC1
InChI Key InChIKey=MOARLOGPIPTREO-UHFFFAOYSA-N
Data  1 IC50
  Tab Delimited (TSV)   2D SDfile   Computed 3D by Vconf -m prep SDfile
Find this compound or compounds like it in BindingDB:
Activity Spreadsheet -- Enzyme Inhibition Constant Data from BindingDB
Found 1 hit for monomerid = 50163847
TargetCyclin-dependent kinase 8(Homo sapiens (Human))
The Institute Of Cancer Research
Curated by ChEMBL
LigandPNGBDBM50163847(CHEMBL3800307)
Affinity DataIC50:  21nM. Assay description: Binding affinity to His-tagged CDK8 (unknown origin) after 60 mins by FRET based lanthascreen binding assay
In DepthDetails ArticlePubMed