BDBM50167069 CHEMBL3799593
SMILES COc1ccccc1OCCNC[C@@H](O)c1ccc(O)c(O)c1
InChI Key InChIKey=AFWAVLNIGSUCHI-OAHLLOKOSA-N
Data  7 KI  2 EC50
  Tab Delimited (TSV)   2D SDfile   Computed 3D by Vconf -m prep SDfile
Find this compound or compounds like it in BindingDB:
Activity Spreadsheet -- Enzyme Inhibition Constant Data from BindingDB
Found 2 hits for monomerid = 50167069
TargetBeta-2 adrenergic receptor(Homo sapiens (Human))
Friedrich-Alexander University
Curated by ChEMBL
LigandPNGBDBM50167069(CHEMBL3799593)
Affinity DataEC50:  1.40E+3nM. Assay description: Agonist activity at human beta2 receptor expressed in HEK293 cells cotransfected with Gqs5 protein assessed as [3H]IP3 accumulation after 120 mins by...
In DepthDetails ArticlePubMed
TargetBeta-2 adrenergic receptor(Homo sapiens (Human))
Friedrich-Alexander University
Curated by ChEMBL
LigandPNGBDBM50167069(CHEMBL3799593)
Affinity DataEC50:  2.20E+3nM. Assay description: Agonist activity at PK-tagged beta2 receptor (unknown origin) transfected in HEK293 cells after 90 mins by beta-arrestin assay
In DepthDetails ArticlePubMed