BDBM50167774 (2-Hydrazinocarbonyl-ethyl)-phosphonic acid::CHEMBL193857
SMILES NNC(=O)CCP(O)(O)=O
InChI Key InChIKey=GVGOZVUTXDMHRB-UHFFFAOYSA-N
Data  1 IC50
  Tab Delimited (TSV)   2D SDfile   Computed 3D by Vconf -m prep SDfile
Find this compound or compounds like it in BindingDB:
Activity Spreadsheet -- Enzyme Inhibition Constant Data from BindingDB
Found 1 hit for monomerid = 50167774
TargetTriosephosphate isomerase(Oryctolagus cuniculus)
Paris-Sud University
Curated by ChEMBL
LigandPNGBDBM50167774((2-Hydrazinocarbonyl-ethyl)-phosphonic acid | CHEM...)
Affinity DataIC50:  2.70E+7nM. Assay description: Inhibitory concentration against rabbit muscle triose-phosphate isomerase
In DepthDetails ArticlePubMed