BDBM50169301 7-(3-Amino-phenyl)-2-furan-2-yl-[1,2,4]triazolo[1,5-c]pyrimidin-5-ylamine::CHEMBL366905
SMILES Nc1cccc(c1)-c1cc2nc(nn2c(N)n1)-c1ccco1
InChI Key InChIKey=ACHCEXBCXBDHMK-UHFFFAOYSA-N
Data  1 KI
  Tab Delimited (TSV)   2D SDfile   Computed 3D by Vconf -m prep SDfile
Find this compound or compounds like it in BindingDB:
Activity Spreadsheet -- Enzyme Inhibition Constant Data from BindingDB
Found 1 hit for monomerid = 50169301
TargetAdenosine receptor A2a(Rattus norvegicus (rat))
Schering-Plough Research Institute
Curated by ChEMBL
LigandPNGBDBM50169301(7-(3-Amino-phenyl)-2-furan-2-yl-[1,2,4]triazolo[1,...)
Affinity DataKi:  5nM. Assay description: In vitro ability to displace [3H]-SCH-58,261 from A2A adenosine receptor in Rat
In DepthDetails ArticlePubMed