BDBM50169957 CHEMBL190710::N-[4-(2,3-Dihydro-benzo[1,4]dioxin-2-yl)-thiazol-2-yl]-guanidine
SMILES [#7]\[#6](-[#7])=[#7]/c1nc(cs1)-[#6]-1-[#6]-[#8]-c2ccccc2-[#8]-1
InChI Key InChIKey=DDEDHFJPXRGLCT-UHFFFAOYSA-N
Data  1 Kd
  Tab Delimited (TSV)   2D SDfile   Computed 3D by Vconf -m prep SDfile
Find this compound or compounds like it in BindingDB:
Activity Spreadsheet -- Enzyme Inhibition Constant Data from BindingDB
Found 1 hit for monomerid = 50169957
TargetMitogen-activated protein kinase 1(Homo sapiens (Human))
University Of Maryland
Curated by ChEMBL
LigandPNGBDBM50169957(CHEMBL190710 | N-[4-(2,3-Dihydro-benzo[1,4]dioxin-...)
Affinity DataKd:  1.60E+4nM. Assay description: Dissociation constant for ERK2 kinase
In DepthDetails ArticlePubMed