BDBM50170497 3-Benzoyl-N-(4-hydroxycarbamoylmethyl-thiazol-2-yl)-benzamide::CHEMBL189656
SMILES ONC(=O)Cc1csc(NC(=O)c2cccc(c2)C(=O)c2ccccc2)n1
InChI Key InChIKey=YHBQQQDVVGYINN-UHFFFAOYSA-N
Data  2 IC50
  Tab Delimited (TSV)   2D SDfile   Computed 3D by Vconf -m prep SDfile
Find this compound or compounds like it in BindingDB:
Activity Spreadsheet -- Enzyme Inhibition Constant Data from BindingDB
Found 2 hits for monomerid = 50170497
TargetcGMP-specific 3',5'-cyclic phosphodiesterase(Homo sapiens (Human))
Sumitomo Pharmaceuticals
Curated by ChEMBL
LigandPNGBDBM50170497(3-Benzoyl-N-(4-hydroxycarbamoylmethyl-thiazol-2-yl...)
Affinity DataIC50:  3.41E+3nM. Assay description: Inhibitory concentration against Phosphodiesterase type 5
In DepthDetails ArticlePubMed
LigandPNGBDBM50170497(3-Benzoyl-N-(4-hydroxycarbamoylmethyl-thiazol-2-yl...)
Affinity DataIC50:  1.72E+3nM. Assay description: Inhibitory concentration against Phosphodiesterase type 1
In DepthDetails ArticlePubMed