BDBM50171394 2-Decyl-2H-pyrazolo[3,4-d]pyrimidin-4-ylamine::CHEMBL363042
SMILES CCCCCCCCCCn1cc2c(N)ncnc2n1
InChI Key InChIKey=OMENAFKETKJPHL-UHFFFAOYSA-N
Data  2 KI
  Tab Delimited (TSV)   2D SDfile   Computed 3D by Vconf -m prep SDfile
Find this compound or compounds like it in BindingDB:
Activity Spreadsheet -- Enzyme Inhibition Constant Data from BindingDB
Found 2 hits for monomerid = 50171394
TargetAdenosine deaminase(Bos taurus (bovine))
Universit£
Curated by ChEMBL
LigandPNGBDBM50171394(2-Decyl-2H-pyrazolo[3,4-d]pyrimidin-4-ylamine | CH...)
Affinity DataKi:  0.130nM. Assay description: Inhibitory constant against bovine spleen Adenosine deaminase
In DepthDetails ArticlePubMed
TargetVascular endothelial growth factor receptor 2(Homo sapiens (Human))
Chaminade University Of Honolulu
Curated by ChEMBL
LigandPNGBDBM50171394(2-Decyl-2H-pyrazolo[3,4-d]pyrimidin-4-ylamine | CH...)
Affinity DataKi:  0.130nM. Assay description: Inhibition of human recombinant His-tagged VEGFR2 assessed as infrared absorptionChecked by Author
In DepthDetails ArticlePubMed