BDBM50172418 CHEMBL195635::N-[4-Methyl-2-(4-pyrrolidin-1-yl-piperidin-1-yl)-quinolin-6-yl]-2-(4-trifluoromethoxy-phenoxy)-acetamide
SMILES Cc1cc(nc2ccc(NC(=O)COc3ccc(OC(F)(F)F)cc3)cc12)N1CCC(CC1)N1CCCC1
InChI Key InChIKey=ROIFDGZSVAMLHB-UHFFFAOYSA-N
Data  4 IC50
  Tab Delimited (TSV)   2D SDfile   Computed 3D by Vconf -m prep SDfile
Find this compound or compounds like it in BindingDB:
Activity Spreadsheet -- Enzyme Inhibition Constant Data from BindingDB
Found 4 hits for monomerid = 50172418
TargetMelanin-concentrating hormone receptor 1(Homo sapiens (Human))
7Tm Pharma
Curated by ChEMBL
LigandPNGBDBM50172418(CHEMBL195635 | N-[4-Methyl-2-(4-pyrrolidin-1-yl-pi...)
Affinity DataIC50:  7.5nM. Assay description: Inhibitory concentration against 10 nM MCH-induced IP3 accumulation in CHO-K1 cells expressing human MCH1R after incubation with [3H]-myo-inositol
In DepthDetails ArticlePubMed
TargetMelanin-concentrating hormone receptor 2(Homo sapiens (Human))
7Tm Pharma
Curated by ChEMBL
LigandPNGBDBM50172418(CHEMBL195635 | N-[4-Methyl-2-(4-pyrrolidin-1-yl-pi...)
Affinity DataIC50:  6.30nM. Assay description: Displacement of 15 pM [125I]-MCH from human MCH2R expressed in CHO-K1 in whole-cell binding assay
In DepthDetails ArticlePubMed
TargetMelanin-concentrating hormone receptor 1(Homo sapiens (Human))
7Tm Pharma
Curated by ChEMBL
LigandPNGBDBM50172418(CHEMBL195635 | N-[4-Methyl-2-(4-pyrrolidin-1-yl-pi...)
Affinity DataIC50:  7.10nM. Assay description: Displacement of 150p M [125I]-MCH from human MCH1R expressed in CHO-K1 cells
In DepthDetails ArticlePubMed
TargetMelanin-concentrating hormone receptor 1(Homo sapiens (Human))
7Tm Pharma
Curated by ChEMBL
LigandPNGBDBM50172418(CHEMBL195635 | N-[4-Methyl-2-(4-pyrrolidin-1-yl-pi...)
Affinity DataIC50:  1.5nM. Assay description: Displacement of 15 pM [125I]-MCH from human MCH1R expressed in CHO-K1 in whole-cell binding assay
In DepthDetails ArticlePubMed