BDBM50173430 (3R,3aS,4S,4aR,8aS,9aR)-4-{(E)-2-[5-(3-Bromo-phenyl)-pyridin-2-yl]-vinyl}-3-methyl-decahydro-naphtho[2,3-c]furan-1-one::CHEMBL198375
SMILES C[C@H]1OC(=O)[C@@H]2C[C@@H]3CCCC[C@H]3[C@H](\C=C\c3ccc(cn3)-c3cccc(Br)c3)[C@H]12
InChI Key InChIKey=BRSVGVIWEHXIAL-HLBWOJLBSA-N
Data  1 IC50
  Tab Delimited (TSV)   2D SDfile   Computed 3D by Vconf -m prep SDfile
Find this compound or compounds like it in BindingDB:
Activity Spreadsheet -- Enzyme Inhibition Constant Data from BindingDB
Found 1 hit for monomerid = 50173430
TargetProteinase-activated receptor 1(Homo sapiens (Human))
Schering-Plough Research Institute
Curated by ChEMBL
LigandPNGBDBM50173430((3R,3aS,4S,4aR,8aS,9aR)-4-{(E)-2-[5-(3-Bromo-pheny...)
Affinity DataIC50:  25nM. Assay description: In vitro inhibitory concentration aganist human protease activated receptor 1 using [3H]-haTRAP as radioligand
In DepthDetails ArticlePubMed