BDBM50174012 (S)-N-(1-(3-(trifluoromethyl)benzyl)pyrrolidin-3-yl)-4-(thiophen-2-yl)benzamide::CHEMBL372770
SMILES FC(F)(F)c1cccc(CN2CC[C@@H](C2)NC(=O)c2ccc(cc2)-c2cccs2)c1
InChI Key InChIKey=CAXQUECQSWHONO-FQEVSTJZSA-N
Data  1 KI
  Tab Delimited (TSV)   2D SDfile   Computed 3D by Vconf -m prep SDfile
Find this compound or compounds like it in BindingDB:
Activity Spreadsheet -- Enzyme Inhibition Constant Data from BindingDB
Found 1 hit for monomerid = 50174012
TargetD(4) dopamine receptor(Homo sapiens (Human))
Nps Pharmaceuticals
Curated by ChEMBL
LigandPNGBDBM50174012((S)-N-(1-(3-(trifluoromethyl)benzyl)pyrrolidin-3-y...)
Affinity DataKi:  22nM. Assay description: Displacement of [3H]spiperone from cloned human dopamine D4.2 receptor in HEK298 cells
In DepthDetails ArticlePubMed