BDBM50174365 4-[3-(2,4-Dichloro-benzoyl)-ureido]-3-methoxy-N-methyl-benzamide::CHEMBL365785
SMILES CNC(=O)c1ccc(NC(=O)NC(=O)c2ccc(Cl)cc2Cl)c(OC)c1
InChI Key InChIKey=BMIDVNYBPJOCBG-UHFFFAOYSA-N
Data  2 IC50
  Tab Delimited (TSV)   2D SDfile   Computed 3D by Vconf -m prep SDfile
Find this compound or compounds like it in BindingDB:
Activity Spreadsheet -- Enzyme Inhibition Constant Data from BindingDB
Found 2 hits for monomerid = 50174365
TargetGlycogen phosphorylase, liver form(Homo sapiens (Human))
Sanofi-Aventis Deutschland
Curated by ChEMBL
LigandPNGBDBM50174365(4-[3-(2,4-Dichloro-benzoyl)-ureido]-3-methoxy-N-me...)
Affinity DataIC50:  407nMpH: 7.2Assay Description:Logarithmic inhibitory concentration against human liver glycogen phosphorylase enzyme by the addition of glucose-1-phosphate and incubated for 40 mi...
In DepthDetails ArticlePubMed
TargetGlycogen phosphorylase, liver form(Homo sapiens (Human))
Sanofi-Aventis Deutschland
Curated by ChEMBL
LigandPNGBDBM50174365(4-[3-(2,4-Dichloro-benzoyl)-ureido]-3-methoxy-N-me...)
Affinity DataIC50:  410nMpH: 7.2Assay Description:Inhibitory concentration against human liver glycogen phosphorylase enzyme by the addition of glucose-1-phosphate upon incubating for 40 min at 25 de...
In DepthDetails ArticlePubMed