BDBM50174367 2-Amino-4-[3-(2-chloro-4-fluoro-benzoyl)-ureido]-benzoic acid::CHEMBL199099
SMILES Nc1cc(NC(=O)NC(=O)c2ccc(F)cc2Cl)ccc1C(O)=O
InChI Key InChIKey=SFZAYPRJKCBSPL-UHFFFAOYSA-N
Data  2 IC50
  Tab Delimited (TSV)   2D SDfile   Computed 3D by Vconf -m prep SDfile
Find this compound or compounds like it in BindingDB:
Activity Spreadsheet -- Enzyme Inhibition Constant Data from BindingDB
Found 2 hits for monomerid = 50174367
TargetGlycogen phosphorylase, liver form(Homo sapiens (Human))
Sanofi-Aventis Deutschland
Curated by ChEMBL
LigandPNGBDBM50174367(2-Amino-4-[3-(2-chloro-4-fluoro-benzoyl)-ureido]-b...)
Affinity DataIC50:  708nMpH: 7.2Assay Description:Logarithmic inhibitory concentration against human liver glycogen phosphorylase enzyme by the addition of glucose-1-phosphate and incubated for 40 mi...
In DepthDetails ArticlePubMed
TargetGlycogen phosphorylase, liver form(Homo sapiens (Human))
Sanofi-Aventis Deutschland
Curated by ChEMBL
LigandPNGBDBM50174367(2-Amino-4-[3-(2-chloro-4-fluoro-benzoyl)-ureido]-b...)
Affinity DataIC50:  700nMpH: 7.2Assay Description:Inhibitory concentration against human liver glycogen phosphorylase enzyme by the addition of glucose-1-phosphate upon incubating for 40 min at 25 de...
In DepthDetails ArticlePubMed