BDBM50174372 1-(2-Chloro-benzoyl)-3-(5-hydroxy-2-methoxy-phenyl)-urea::CHEMBL414851
SMILES COc1ccc(O)cc1NC(=O)NC(=O)c1ccccc1Cl
InChI Key InChIKey=PADDSHFPVSZIJT-UHFFFAOYSA-N
Data  2 IC50
  Tab Delimited (TSV)   2D SDfile   Computed 3D by Vconf -m prep SDfile
Find this compound or compounds like it in BindingDB:
Activity Spreadsheet -- Enzyme Inhibition Constant Data from BindingDB
Found 2 hits for monomerid = 50174372
TargetGlycogen phosphorylase, liver form(Homo sapiens (Human))
Sanofi-Aventis Deutschland
Curated by ChEMBL
LigandPNGBDBM50174372(1-(2-Chloro-benzoyl)-3-(5-hydroxy-2-methoxy-phenyl...)
Affinity DataIC50:  64.6nMpH: 7.2Assay Description:Logarithmic inhibitory concentration against human liver glycogen phosphorylase enzyme by the addition of glucose-1-phosphate and incubated for 40 mi...
In DepthDetails ArticlePubMed
TargetGlycogen phosphorylase, liver form(Homo sapiens (Human))
Sanofi-Aventis Deutschland
Curated by ChEMBL
LigandPNGBDBM50174372(1-(2-Chloro-benzoyl)-3-(5-hydroxy-2-methoxy-phenyl...)
Affinity DataIC50:  65nMpH: 7.2Assay Description:Inhibitory concentration against human liver glycogen phosphorylase enzyme by the addition of glucose-1-phosphate upon incubating for 40 min at 25 de...
In DepthDetails ArticlePubMed