BDBM50176393 CHEMBL383095::octanoic acid (S)-2-octanoyloxy-3-phosphonooxy-propyl ester
SMILES CCCCCCCC(=O)OC[C@@H](COP(O)(O)=O)OC(=O)CCCCCCC
InChI Key InChIKey=XYSBQYUENLDGMI-KRWDZBQOSA-N
Data  2 KI  2 IC50
  Tab Delimited (TSV)   2D SDfile   Computed 3D by Vconf -m prep SDfile
Find this compound or compounds like it in BindingDB:
Activity Spreadsheet -- Enzyme Inhibition Constant Data from BindingDB
Found 4 hits for monomerid = 50176393
TargetLysophosphatidic acid receptor 3(Homo sapiens (Human))
University Of Tennessee Health Science Center
Curated by ChEMBL
LigandPNGBDBM50176393(CHEMBL383095 | octanoic acid (S)-2-octanoyloxy-3-p...)
Affinity DataKi:  119nM. Assay description: Activity at LPA3 receptor transfected RH7777 cells
In DepthDetails ArticlePubMed
TargetLysophosphatidic acid receptor 1(Homo sapiens (Human))
University Of Tennessee Health Science Center
Curated by ChEMBL
LigandPNGBDBM50176393(CHEMBL383095 | octanoic acid (S)-2-octanoyloxy-3-p...)
Affinity DataKi:  221nM. Assay description: Activity at LPA1 receptor transfected RH7777 cells
In DepthDetails ArticlePubMed
TargetLysophosphatidic acid receptor 3(Homo sapiens (Human))
University Of Tennessee Health Science Center
Curated by ChEMBL
LigandPNGBDBM50176393(CHEMBL383095 | octanoic acid (S)-2-octanoyloxy-3-p...)
Affinity DataIC50:  207nM. Assay description: Activity at LPA3 receptor transfected RH7777 cells
In DepthDetails ArticlePubMed
TargetLysophosphatidic acid receptor 1(Homo sapiens (Human))
University Of Tennessee Health Science Center
Curated by ChEMBL
LigandPNGBDBM50176393(CHEMBL383095 | octanoic acid (S)-2-octanoyloxy-3-p...)
Affinity DataIC50:  433nM. Assay description: Activity at LPA1 receptor transfected RH7777 cells
In DepthDetails ArticlePubMed