BDBM50177574 3-(4-(2-methoxybenzyloxy)phenylsulfonyl)-N-mesityl-6-methylpyridin-2-amine::CHEMBL381824
SMILES COc1ccccc1COc1ccc(cc1)S(=O)(=O)c1ccc(C)nc1Nc1c(C)cc(C)cc1C
InChI Key InChIKey=CHXHYNLIAHUNMG-UHFFFAOYSA-N
Data  1 KI
  Tab Delimited (TSV)   2D SDfile   Computed 3D by Vconf -m prep SDfile
Find this compound or compounds like it in BindingDB:
Activity Spreadsheet -- Enzyme Inhibition Constant Data from BindingDB
Found 1 hit for monomerid = 50177574
TargetCorticotropin-releasing factor receptor 1(Rattus norvegicus (rat))
Pharmaceutical Research Institute
Curated by ChEMBL
LigandPNGBDBM50177574(3-(4-(2-methoxybenzyloxy)phenylsulfonyl)-N-mesityl...)
Affinity DataKi:  17nM. Assay description: Displacement of [125I]Tyr-o-CRF from CRF1 receptor in rat frontal cortex homogenates
In DepthDetails ArticlePubMed