BDBM50178281 CHEMBL3814357
SMILES CCc1cc(nc(N)n1)-c1c[nH]c2ncc(cc12)-c1cccnc1
InChI Key InChIKey=QDMKNNFWIFASRH-UHFFFAOYSA-N
Data  2 IC50
  Tab Delimited (TSV)   2D SDfile   Computed 3D by Vconf -m prep SDfile
Find this compound or compounds like it in BindingDB:
Activity Spreadsheet -- Enzyme Inhibition Constant Data from BindingDB
Found 2 hits for monomerid = 50178281
Target3-phosphoinositide-dependent protein kinase 1(Homo sapiens (Human))
Merck
Curated by ChEMBL
LigandPNGBDBM50178281(CHEMBL3814357)
Affinity DataIC50:  500nM. Assay description: Inhibition of human His6-tagged PDK1 using biotinylated PDKtide as substrate after 60 mins by topcount method
In DepthDetails ArticlePubMed
Target3-phosphoinositide-dependent protein kinase 1(Homo sapiens (Human))
Merck
Curated by ChEMBL
LigandPNGBDBM50178281(CHEMBL3814357)
Affinity DataIC50: >3.00E+4nM. Assay description: Inhibition of PDK1 in human PC3 cells assessed as reduction in AKT Thr308 phosphorylation after 45 mins
In DepthDetails ArticlePubMed