BDBM50179384 CHEMBL3814220
SMILES CCCCCn1c(C)cc(NCc2ccccc2)cc1=O
InChI Key InChIKey=XCEYUKNURZMKTA-UHFFFAOYSA-N
Data  1 KI
  Tab Delimited (TSV)   2D SDfile   Computed 3D by Vconf -m prep SDfile
Find this compound or compounds like it in BindingDB:
Activity Spreadsheet -- Enzyme Inhibition Constant Data from BindingDB
Found 1 hit for monomerid = 50179384
TargetAlpha-2A adrenergic receptor(Homo sapiens (Human))
University Of Belgrade
Curated by ChEMBL
LigandPNGBDBM50179384(CHEMBL3814220)
Affinity DataKi:  4.10E+4nM. Assay description: Displacement of [3H]RS-79948-197 from recombinant human alpha2A adrenoreceptor expressed in CHOK1 cell membrane by scintillation counting method
In DepthDetails ArticlePubMed