BDBM50179581 (+)-2-(2-(2-((3R,3aS,4S,4aR,8aS,9aR)-3-methyl-1-oxo-dodecahydronaphtho[2,3-c]furan-4-yl)vinyl)quinolin-6-yloxy)-N-phenylacetamide::CHEMBL382830
SMILES C[C@H]1OC(=O)[C@@H]2C[C@@H]3CCCC[C@H]3[C@H](\C=C\c3ccc4cc(OCC(=O)Nc5ccccc5)ccc4n3)[C@H]12
InChI Key InChIKey=BDBPAVHTWMVWHN-SORLVKKQSA-N
Data  1 IC50
  Tab Delimited (TSV)   2D SDfile   Computed 3D by Vconf -m prep SDfile
Find this compound or compounds like it in BindingDB:
Activity Spreadsheet -- Enzyme Inhibition Constant Data from BindingDB
Found 1 hit for monomerid = 50179581
TargetProteinase-activated receptor 1(Homo sapiens (Human))
Schering-Plough Research Institute
Curated by ChEMBL
LigandPNGBDBM50179581((+)-2-(2-(2-((3R,3aS,4S,4aR,8aS,9aR)-3-methyl-1-ox...)
Affinity DataIC50:  25nM. Assay description: Displacement of [3H]haTRAP from PAR1 in human platelet membrane
In DepthDetails ArticlePubMed