BDBM50184867 2-Cyclohexylethyl N-{4-[(6,7-Dimethoxy-4-quinolyl)oxy]-phenyl}carbamate::CHEMBL425043
SMILES COc1cc2nccc(Oc3ccc(NC(=O)OCCC4CCCCC4)cc3)c2cc1OC
InChI Key InChIKey=NVXYJRPMNZXXML-UHFFFAOYSA-N
Data  2 IC50
  Tab Delimited (TSV)   2D SDfile   Computed 3D by Vconf -m prep SDfile
Find this compound or compounds like it in BindingDB:
Activity Spreadsheet -- Enzyme Inhibition Constant Data from BindingDB
Found 2 hits for monomerid = 50184867
TargetPlatelet-derived growth factor receptor alpha(Homo sapiens (Human))
Kirin Brewery
Curated by ChEMBL
LigandPNGBDBM50184867(2-Cyclohexylethyl N-{4-[(6,7-Dimethoxy-4-quinolyl)...)
Affinity DataIC50:  18nM. Assay description: Inhibition of PDGFR alpha phosphorylation in G292 cell
In DepthDetails ArticlePubMed
TargetMast/stem cell growth factor receptor Kit(Homo sapiens (Human))
Kirin Brewery
Curated by ChEMBL
LigandPNGBDBM50184867(2-Cyclohexylethyl N-{4-[(6,7-Dimethoxy-4-quinolyl)...)
Affinity DataIC50:  80nM. Assay description: Inhibition of c-kit receptor phosphorylation in M07e cell
In DepthDetails ArticlePubMed