BDBM50185715 CHEMBL3823517
SMILES OC(=O)c1cncc(c1)N1CC(O)(C1)c1ccc(OCc2c(onc2-c2c(Cl)cccc2Cl)C2CC2)cc1Cl
InChI Key InChIKey=RECGOOIVMAFZGM-UHFFFAOYSA-N
Data  2 EC50
  Tab Delimited (TSV)   2D SDfile   Computed 3D by Vconf -m prep SDfile
Find this compound or compounds like it in BindingDB:
Activity Spreadsheet -- Enzyme Inhibition Constant Data from BindingDB
Found 2 hits for monomerid = 50185715
TargetBile acid receptor(Homo sapiens (Human))
Phenex Pharmaceuticals
Curated by ChEMBL
LigandPNGBDBM50185715(CHEMBL3823517)
Affinity DataEC50:  7nM. Assay description: Agonist activity at GST-tagged FXR LBD (187 to 472 residues) (unknown origin) assessed as FXR interaction with b-CPSSHSSLTERHKILHRLLQEGSPS-COOH by FR...
In DepthDetails ArticlePubMed
TargetBile acid receptor(Homo sapiens (Human))
Phenex Pharmaceuticals
Curated by ChEMBL
LigandPNGBDBM50185715(CHEMBL3823517)
Affinity DataEC50:  552nM. Assay description: Agonist activity at C-terminal Gal4-tagged human FXR (187 to 472 residues) expressed in HEK-293 cells co-expressing pFRluc by mammalian one hybrid as...
In DepthDetails ArticlePubMed