BDBM50186606 3-(4-hydroxyphenyl)prop-1,2-diyl dinitrate::CHEMBL207967
SMILES Oc1ccc(CC(CO[N+]([O-])=O)[N+]([O-])=O)cc1
InChI Key InChIKey=GUNBYSUWZKSKST-UHFFFAOYSA-N
Data  2 EC50
  Tab Delimited (TSV)   2D SDfile   Computed 3D by Vconf -m prep SDfile
Find this compound or compounds like it in BindingDB:
Activity Spreadsheet -- Enzyme Inhibition Constant Data from BindingDB
Found 2 hits for monomerid = 50186606
TargetAlpha-1D adrenergic receptor(Rattus norvegicus (Rat))
Università
Curated by ChEMBL
LigandPNGBDBM50186606(3-(4-hydroxyphenyl)prop-1,2-diyl dinitrate | CHEMB...)
Affinity DataEC50:  130nM. Assay description: Vasodilator activity assessed as ability to relax phenylephrine-induced contraction of Wistar rat aortic strips
In DepthDetails ArticlePubMed
TargetAlpha-1D adrenergic receptor(Rattus norvegicus (Rat))
Università
Curated by ChEMBL
LigandPNGBDBM50186606(3-(4-hydroxyphenyl)prop-1,2-diyl dinitrate | CHEMB...)
Affinity DataEC50:  6.50E+4nM. Assay description: Vasodilator activity assessed as ability to relax phenylephrine-induced contraction of Wistar rat aortic strips in presence of 1 uM ODQ
In DepthDetails ArticlePubMed