BDBM50186608 3-((4-hydroxy-3,5-dimethoxy)phenyl)prop-1,2-diyl dinitrate::CHEMBL381054
SMILES COc1cc(CC(CO[N+]([O-])=O)[N+]([O-])=O)cc(OC)c1O
InChI Key InChIKey=WDEGMTMTRQEPGR-UHFFFAOYSA-N
Data  2 EC50
  Tab Delimited (TSV)   2D SDfile   Computed 3D by Vconf -m prep SDfile
Find this compound or compounds like it in BindingDB:
Activity Spreadsheet -- Enzyme Inhibition Constant Data from BindingDB
Found 2 hits for monomerid = 50186608
TargetAlpha-1D adrenergic receptor(Rattus norvegicus (Rat))
Università
Curated by ChEMBL
LigandPNGBDBM50186608(3-((4-hydroxy-3,5-dimethoxy)phenyl)prop-1,2-diyl d...)
Affinity DataEC50:  640nM. Assay description: Vasodilator activity assessed as ability to relax phenylephrine-induced contraction of Wistar rat aortic strips
In DepthDetails ArticlePubMed
TargetAlpha-1D adrenergic receptor(Rattus norvegicus (Rat))
Università
Curated by ChEMBL
LigandPNGBDBM50186608(3-((4-hydroxy-3,5-dimethoxy)phenyl)prop-1,2-diyl d...)
Affinity DataEC50:  4.90E+4nM. Assay description: Vasodilator activity assessed as ability to relax phenylephrine-induced contraction of Wistar rat aortic strips in presence of 1 uM ODQ
In DepthDetails ArticlePubMed