BDBM50187195 7-(4-fluorobenzyl)-9-hydroxy-6-methyl-8-oxo-7,8-dihydro-6H-pyrrolo[3,4-g]quinolin-5-yl dimethylsulfamate::CHEMBL378117
SMILES CC1N(Cc2ccc(F)cc2)C(=O)c2c1c(OS(=O)(=O)N(C)C)c1cccnc1c2O
InChI Key InChIKey=ICBVLBQDAJSTNX-UHFFFAOYSA-N
Data  1 IC50
  Tab Delimited (TSV)   2D SDfile   Computed 3D by Vconf -m prep SDfile
Find this compound or compounds like it in BindingDB:
Activity Spreadsheet -- Enzyme Inhibition Constant Data from BindingDB
Found 1 hit for monomerid = 50187195
TargetIntegrase(Human immunodeficiency virus 1)
Gilead Sciences
Curated by ChEMBL
LigandPNGBDBM50187195(7-(4-fluorobenzyl)-9-hydroxy-6-methyl-8-oxo-7,8-di...)
Affinity DataIC50:  815nM. Assay description: Inhibition of HIV1 integrase strand transfer activity in MT4 cell line
In DepthDetails ArticlePubMed