BDBM50187915 1-(4-(4-(diethylamino)butoxy)phenyl)-3-(3-(trifluoromethyl)phenylimino)indolin-2-one::CHEMBL377328
SMILES CCN(CC)CCCCOc1ccc(cc1)N1C(=O)\C(=N\c2cccc(c2)C(F)(F)F)c2ccccc12
InChI Key InChIKey=CCKSFWNZIUGOIE-MUGXBBEHSA-N
Data  1 KI
  Tab Delimited (TSV)   2D SDfile   Computed 3D by Vconf -m prep SDfile
Find this compound or compounds like it in BindingDB:
Activity Spreadsheet -- Enzyme Inhibition Constant Data from BindingDB
Found 1 hit for monomerid = 50187915
TargetGalanin receptor type 3(Homo sapiens (Human))
Lundbeck Research Usa
Curated by ChEMBL
LigandPNGBDBM50187915(1-(4-(4-(diethylamino)butoxy)phenyl)-3-(3-(trifluo...)
Affinity DataKi:  70nM. Assay description: Displacement of [125I]galanin from human galanin Gal3 receptor
In DepthDetails ArticlePubMed