BDBM50189527 CHEMBL3827310
SMILES Oc1cc(O)nc(SCCCCc2ccccc2)n1
InChI Key InChIKey=LABYUMHKNMNLQJ-UHFFFAOYSA-N
Data  1 KI  1 EC50
  Tab Delimited (TSV)   2D SDfile   Computed 3D by Vconf -m prep SDfile
Find this compound or compounds like it in BindingDB:
Activity Spreadsheet -- Enzyme Inhibition Constant Data from BindingDB
Found 2 hits for monomerid = 50189527
TargetG-protein coupled receptor 84(Homo sapiens (Human))
University Of Bonn
Curated by ChEMBL
LigandPNGBDBM50189527(CHEMBL3827310)
Affinity DataKi:  0.324nM. Assay description: Displacement of [3H]PSB-1584 from recombinant human GPR84 expressed in CHO cell membranes co-expressing beta-arrestin2 measured after 6 hrs by scinti...
In DepthDetails ArticlePubMed
TargetG-protein coupled receptor 84(Homo sapiens (Human))
University Of Bonn
Curated by ChEMBL
LigandPNGBDBM50189527(CHEMBL3827310)
Affinity DataEC50:  435nM. Assay description: Agonist activity at GPR84 (unknown origin) expressed in HEK293 cells coexpressing Galpha16 protein by Fluo-4 AM dye based calcium mobilization assay
In DepthDetails ArticlePubMed