BDBM50189938 2-{5-(4-amino-1H-pyrrolo[3,2-c]pyridin-2-yl)-3'-[3-(2,6-difluoro-phenyl)-ureidomethyl]-6-hydroxy-biphenyl-3-yl}-2-methyl-propionic acid::CHEMBL209946
SMILES CC(C)(C(O)=O)c1cc(-c2cc3c(N)nccc3[nH]2)c(O)c(c1)-c1cccc(CNC(=O)Nc2c(F)cccc2F)c1
InChI Key InChIKey=TWSQKXMRVBVBEG-UHFFFAOYSA-N
Data  1 KI
  Tab Delimited (TSV)   2D SDfile   Computed 3D by Vconf -m prep SDfile
Find this compound or compounds like it in BindingDB:
Activity Spreadsheet -- Enzyme Inhibition Constant Data from BindingDB
Found 1 hit for monomerid = 50189938
TargetCoagulation factor VII/Tissue factor(Homo sapiens (Human))
Celera Genomics
Curated by ChEMBL
LigandPNGBDBM50189938(2-{5-(4-amino-1H-pyrrolo[3,2-c]pyridin-2-yl)-3'-[3...)
Affinity DataKi:  2.60nM. Assay description: Binding affinity to f7a/TF complex
In DepthDetails ArticlePubMed