BDBM50190831 (+/-)-trans-methyl-3-(3,5-bis(trifluoromethyl)benzyloxy)-2-phenylcyclopentyl(methyl)carbamate::CHEMBL378076
SMILES COC(=O)N(C)[C@@H]1CC[C@H](OCc2cc(cc(c2)C(F)(F)F)C(F)(F)F)[C@H]1c1ccccc1
InChI Key InChIKey=XLQRBGCAMPLWHK-AABGKKOBSA-N
Data  1 IC50
  Tab Delimited (TSV)   2D SDfile   Computed 3D by Vconf -m prep SDfile
Find this compound or compounds like it in BindingDB:
Activity Spreadsheet -- Enzyme Inhibition Constant Data from BindingDB
Found 1 hit for monomerid = 50190831
TargetSubstance-P receptor(Homo sapiens (Human))
Merck Research Laboratories
Curated by ChEMBL
LigandPNGBDBM50190831((+/-)-trans-methyl-3-(3,5-bis(trifluoromethyl)benz...)
Affinity DataIC50:  6.20nM. Assay description: Displacement of [125I]SP from human cloned NK1 receptor expressed in CHO cells
In DepthDetails ArticlePubMed