BDBM50194130 (4aS,6aS,6bR,8aR,10S,12aR,12bR,14bS)-10-(3-carboxy-3-methylbutanoyloxy)-2,2,6a,6b,9,9,12a-heptamethyl-1,2,3,4,4a,5,6,6a,6b,7,8,8a,9,10,11,12,12a,12b,13,14b-icosahydropicene-4a-carboxylic acid::3-O-(3',3'-dimethylsuccinyl)-oleanolic acid::CHEMBL211369::Oleanolic acid 3-O-(3',3'-dimethyl)succinate
SMILES CC(C)(CC(=O)O[C@H]1CC[C@@]2(C)[C@@H](CC[C@]3(C)[C@@H]2CC=C2[C@@H]4CC(C)(C)CC[C@@]4(CC[C@@]32C)C(O)=O)C1(C)C)C(O)=O
InChI Key InChIKey=CILDPQKNQAUATK-NIWPVQCVSA-N
Data  9 IC50
  Tab Delimited (TSV)   2D SDfile   Computed 3D by Vconf -m prep SDfile
Find this compound or compounds like it in BindingDB:
Activity Spreadsheet -- Enzyme Inhibition Constant Data from BindingDB
Found 9 hits for monomerid = 50194130
TargetTyrosine-protein phosphatase non-receptor type 6(Homo sapiens (Human))
Chinese Academy Of Sciences
Curated by ChEMBL
LigandPNGBDBM50194130((4aS,6aS,6bR,8aR,10S,12aR,12bR,14bS)-10-(3-carboxy...)
Affinity DataIC50:  1.24E+4nM. Assay description: Inhibition of human recombinant SHP1
In DepthDetails ArticlePubMed
TargetReceptor-type tyrosine-protein phosphatase F(Homo sapiens (Human))
Chinese Academy Of Sciences
Curated by ChEMBL
LigandPNGBDBM50194130((4aS,6aS,6bR,8aR,10S,12aR,12bR,14bS)-10-(3-carboxy...)
Affinity DataIC50: >4.00E+4nM. Assay description: Inhibition of human recombinant LAR
In DepthDetails ArticlePubMed
TargetReceptor-type tyrosine-protein phosphatase alpha(Homo sapiens (Human))
Chinese Academy Of Sciences
Curated by ChEMBL
LigandPNGBDBM50194130((4aS,6aS,6bR,8aR,10S,12aR,12bR,14bS)-10-(3-carboxy...)
Affinity DataIC50: >4.00E+4nM. Assay description: Inhibition of human recombinant PTPalpha
In DepthDetails ArticlePubMed
TargetReceptor-type tyrosine-protein phosphatase epsilon(Homo sapiens (Human))
Chinese Academy Of Sciences
Curated by ChEMBL
LigandPNGBDBM50194130((4aS,6aS,6bR,8aR,10S,12aR,12bR,14bS)-10-(3-carboxy...)
Affinity DataIC50: >4.00E+4nM. Assay description: Inhibition of human recombinant PTPepsilon
In DepthDetails ArticlePubMed
TargetIntegrase(Human immunodeficiency virus 1)
East China University Of Science And Technology
Curated by ChEMBL
LigandPNGBDBM50194130((4aS,6aS,6bR,8aR,10S,12aR,12bR,14bS)-10-(3-carboxy...)
Affinity DataIC50:  5.51E+3nM. Assay description: Inhibition of HIV1 His6-tagged integrase-human GST tagged LEDGF/p75 (373-442 residues) interaction after 30 mins by AlphaScreen assay
In DepthDetails ArticlePubMed
TargetTyrosine-protein phosphatase non-receptor type 2(Homo sapiens (Human))
Chinese Academy Of Sciences
Curated by ChEMBL
LigandPNGBDBM50194130((4aS,6aS,6bR,8aR,10S,12aR,12bR,14bS)-10-(3-carboxy...)
Affinity DataIC50:  1.38E+3nM. Assay description: Inhibition of TCPTP (unknown origin) by pNPP assay
In DepthDetails ArticlePubMed
LigandPNGBDBM50194130((4aS,6aS,6bR,8aR,10S,12aR,12bR,14bS)-10-(3-carboxy...)
Affinity DataIC50:  2.33E+3nM. Assay description: Inhibition of PTP1B (unknown origin)
In DepthDetails Article
LigandPNGBDBM50194130((4aS,6aS,6bR,8aR,10S,12aR,12bR,14bS)-10-(3-carboxy...)
Affinity DataIC50:  2.33E+3nM. Assay description: Inhibition of PTP1B (unknown origin)
In DepthDetails Article
LigandPNGBDBM50194130((4aS,6aS,6bR,8aR,10S,12aR,12bR,14bS)-10-(3-carboxy...)
Affinity DataIC50:  2.33E+3nM. Assay description: Inhibition of PTP1B (unknown origin) by pNPP assay
In DepthDetails ArticlePubMed