BDBM50194331 2-hydroxy-2-(5-(2,2,2-trifluoroacetamido)-6-(trifluoromethyl)-1H-indol-2-yl)propyl 2-(trifluoromethyl)benzoate::CHEMBL221744
SMILES CC(O)(COC(=O)c1ccccc1C(F)(F)F)c1cc2cc(NC(=O)C(F)(F)F)c(cc2[nH]1)C(F)(F)F
InChI Key InChIKey=AIIHMGGLKLMWMY-UHFFFAOYSA-N
Data  1 IC50
  Tab Delimited (TSV)   2D SDfile   Computed 3D by Vconf -m prep SDfile
Find this compound or compounds like it in BindingDB:
Activity Spreadsheet -- Enzyme Inhibition Constant Data from BindingDB
Found 1 hit for monomerid = 50194331
TargetAndrogen receptor(Rattus norvegicus (Rat))
Johnson And Johnson Pharmaceutical Research And Development
Curated by ChEMBL
LigandPNGBDBM50194331(2-hydroxy-2-(5-(2,2,2-trifluoroacetamido)-6-(trifl...)
Affinity DataIC50:  150nM. Assay description: Displacement of [3H]R1881 from rat androgen receptor
In DepthDetails ArticlePubMed