BDBM50195802 1-(2,3-dimethylphenyl)-2-[2-(4-methoxyphenyl)ethyl]-2H-1,2,3,4,5-pentazol-1-ylium::CHEMBL387088
SMILES COc1ccc(CCn2nnn[n+]2-c2cccc(C)c2C)cc1
InChI Key InChIKey=ILYSRNJLDBRDDM-UHFFFAOYSA-N
Data  1 IC50
  Tab Delimited (TSV)   2D SDfile   Computed 3D by Vconf -m prep SDfile
Find this compound or compounds like it in BindingDB:
Activity Spreadsheet -- Enzyme Inhibition Constant Data from BindingDB
Found 1 hit for monomerid = 50195802
TargetPotassium voltage-gated channel subfamily A member 5(Homo sapiens (Human))
Procter & Gamble Pharmaceuticals
Curated by ChEMBL
LigandPNGBDBM50195802(1-(2,3-dimethylphenyl)-2-[2-(4-methoxyphenyl)ethyl...)
Affinity DataIC50:  330nM. Assay description: Inhibition of Kv1.5 expressed in LTK- cells by whole cell patch clamp assay
In DepthDetails ArticlePubMed