BDBM50196161 1-[4-acetylamino-2-[(2,1,3-benzothiadiazol-4-ylsulfonyl)amino]benzoyl]-piperidine::CHEMBL214728
SMILES CC(=O)Nc1ccc(C(=O)N2CCCCC2)c(NS(=O)(=O)c2cccc3nsnc23)c1
InChI Key InChIKey=PJTLUTSPJDXMLE-UHFFFAOYSA-N
Data  2 KI
  Tab Delimited (TSV)   2D SDfile   Computed 3D by Vconf -m prep SDfile
Find this compound or compounds like it in BindingDB:
Activity Spreadsheet -- Enzyme Inhibition Constant Data from BindingDB
Found 2 hits for monomerid = 50196161
TargetGastrin/cholecystokinin type B receptor(Homo sapiens (Human))
Johnson And Johnson Pharmaceutical Research And Development
Curated by ChEMBL
LigandPNGBDBM50196161(1-[4-acetylamino-2-[(2,1,3-benzothiadiazol-4-ylsul...)
Affinity DataKi: >1.00E+4nM. Assay description: Displacement of [125I]CCK-8S from human CCK2R
In DepthDetails ArticlePubMed
TargetCholecystokinin receptor type A(Homo sapiens (Human))
Johnson And Johnson Pharmaceutical Research And Development
Curated by ChEMBL
LigandPNGBDBM50196161(1-[4-acetylamino-2-[(2,1,3-benzothiadiazol-4-ylsul...)
Affinity DataKi: >1.00E+4nM. Assay description: Displacement of [125I]CCK-8S from human CCK1R
In DepthDetails ArticlePubMed