BDBM50196169 1-[4-amino-2-[(2,1,3-benzothiadiazol-4-ylsulfonyl)amino]-benzoyl]-piperidine::CHEMBL216559
SMILES Nc1ccc(C(=O)N2CCCCC2)c(NS(=O)(=O)c2cccc3nsnc23)c1
InChI Key InChIKey=CYACBCZJTPRKRD-UHFFFAOYSA-N
Data  1 KI
  Tab Delimited (TSV)   2D SDfile   Computed 3D by Vconf -m prep SDfile
Find this compound or compounds like it in BindingDB:
Activity Spreadsheet -- Enzyme Inhibition Constant Data from BindingDB
Found 1 hit for monomerid = 50196169
TargetCholecystokinin receptor type A(Homo sapiens (Human))
Johnson And Johnson Pharmaceutical Research And Development
Curated by ChEMBL
LigandPNGBDBM50196169(1-[4-amino-2-[(2,1,3-benzothiadiazol-4-ylsulfonyl)...)
Affinity DataKi: >1.00E+4nM. Assay description: Displacement of [125I]CCK-8S from human CCK1R
In DepthDetails ArticlePubMed