BDBM50196210 1-[4-bromo-2-[(5-quinoxalinylsulfonyl)amino]benzoyl]-piperidine::CHEMBL263475
SMILES Brc1ccc(C(=O)N2CCCCC2)c(NS(=O)(=O)c2cccc3nccnc23)n1
InChI Key InChIKey=SZZYMPZMDRABSX-UHFFFAOYSA-N
Data  1 KI
  Tab Delimited (TSV)   2D SDfile   Computed 3D by Vconf -m prep SDfile
Find this compound or compounds like it in BindingDB:
Activity Spreadsheet -- Enzyme Inhibition Constant Data from BindingDB
Found 1 hit for monomerid = 50196210
TargetCholecystokinin receptor type A(Homo sapiens (Human))
Johnson And Johnson Pharmaceutical Research And Development
Curated by ChEMBL
LigandPNGBDBM50196210(1-[4-bromo-2-[(5-quinoxalinylsulfonyl)amino]benzoy...)
Affinity DataKi: >1.00E+4nM. Assay description: Displacement of [125I]CCK-8S from human CCK1R
In DepthDetails ArticlePubMed