BDBM50196216 1-[2-[(2,1,3-benzothiadiazol-4-ylsulfonyl)amino]-benzoyl]-piperidine::CHEMBL384960
SMILES O=C(N1CCCCC1)c1ccccc1NS(=O)(=O)c1cccc2nsnc12
InChI Key InChIKey=RMOYANUIMZXXJY-UHFFFAOYSA-N
Data  1 KI
  Tab Delimited (TSV)   2D SDfile   Computed 3D by Vconf -m prep SDfile
Find this compound or compounds like it in BindingDB:
Activity Spreadsheet -- Enzyme Inhibition Constant Data from BindingDB
Found 1 hit for monomerid = 50196216
TargetGastrin/cholecystokinin type B receptor(Homo sapiens (Human))
Johnson And Johnson Pharmaceutical Research And Development
Curated by ChEMBL
LigandPNGBDBM50196216(1-[2-[(2,1,3-benzothiadiazol-4-ylsulfonyl)amino]-b...)
Affinity DataKi: >1.00E+4nM. Assay description: Displacement of [125I]CCK-8S from human CCK2R
In DepthDetails ArticlePubMed