BDBM50197439 2-beta-carbomethoxy-3-beta-(2-naphthyl)-8-thiabicyclo[3.2.1]octane::CHEMBL387983
SMILES COC(=O)[C@@H]1C2CCC(C[C@@H]1c1ccc3ccccc3c1)S2
InChI Key InChIKey=WTSYZPAQJJEYOS-FPQWYMTMSA-N
Data  2 IC50
  Tab Delimited (TSV)   2D SDfile   Computed 3D by Vconf -m prep SDfile
Find this compound or compounds like it in BindingDB:
Activity Spreadsheet -- Enzyme Inhibition Constant Data from BindingDB
Found 2 hits for monomerid = 50197439
TargetSodium-dependent dopamine transporter(Macaca fascicularis)
Organix
Curated by ChEMBL
LigandPNGBDBM50197439(2-beta-carbomethoxy-3-beta-(2-naphthyl)-8-thiabicy...)
Affinity DataIC50:  16nM. Assay description: Displacement of [3H]WIN 35428 from DAT in rhesus monkey caudate-putamen
In DepthDetails ArticlePubMed
TargetSodium-dependent serotonin transporter(Macaca mulatta)
Organix
Curated by ChEMBL
LigandPNGBDBM50197439(2-beta-carbomethoxy-3-beta-(2-naphthyl)-8-thiabicy...)
Affinity DataIC50:  13nM. Assay description: Displacement of [3H]citalopram from SERT in rhesus monkey caudate-putamen
In DepthDetails ArticlePubMed