BDBM50197690 CHEMBL3976548
SMILES Nc1c(cnn1-c1cc(O)ccc1Cl)C(=O)c1cc2ccccc2[nH]1
InChI Key InChIKey=ANWHQLGKGDJLJO-UHFFFAOYSA-N
Data  6 IC50
  Tab Delimited (TSV)   2D SDfile   Computed 3D by Vconf -m prep SDfile
Find this compound or compounds like it in BindingDB:
Activity Spreadsheet -- Enzyme Inhibition Constant Data from BindingDB
Found 6 hits for monomerid = 50197690
TargetFibroblast growth factor receptor 2(Homo sapiens (Human))
Chugai Pharmaceutical
Curated by ChEMBL
LigandPNGBDBM50197690(CHEMBL3976548)
Affinity DataIC50:  30nM. Assay description: Inhibition of human FGFR2 by time-resolved fluorescence or time-resolved fluorescence assay
In DepthDetails ArticlePubMed
TargetProto-oncogene tyrosine-protein kinase Src(Homo sapiens (Human))
Chugai Pharmaceutical
Curated by ChEMBL
LigandPNGBDBM50197690(CHEMBL3976548)
Affinity DataIC50:  0.180nM. Assay description: Inhibition of human SRC by time-resolved fluorescence or time-resolved fluorescence assay
In DepthDetails ArticlePubMed
TargetVascular endothelial growth factor receptor 2(Homo sapiens (Human))
Chugai Pharmaceutical
Curated by ChEMBL
LigandPNGBDBM50197690(CHEMBL3976548)
Affinity DataIC50:  28nM. Assay description: Inhibition of human KDR by time-resolved fluorescence or time-resolved fluorescence assay
In DepthDetails ArticlePubMed
TargetFibroblast growth factor receptor 4(Homo sapiens (Human))
Chugai Pharmaceutical
Curated by ChEMBL
LigandPNGBDBM50197690(CHEMBL3976548)
Affinity DataIC50:  200nM. Assay description: Inhibition of human FGFR4 by time-resolved fluorescence or time-resolved fluorescence assay
In DepthDetails ArticlePubMed
TargetFibroblast growth factor receptor 3(Homo sapiens (Human))
Chugai Pharmaceutical
Curated by ChEMBL
LigandPNGBDBM50197690(CHEMBL3976548)
Affinity DataIC50:  25nM. Assay description: Inhibition of human FGFR3 by time-resolved fluorescence or time-resolved fluorescence assay
In DepthDetails ArticlePubMed
TargetFibroblast growth factor receptor 1(Homo sapiens (Human))
Chugai Pharmaceutical
Curated by ChEMBL
LigandPNGBDBM50197690(CHEMBL3976548)
Affinity DataIC50:  130nM. Assay description: Inhibition of human FGFR1 by time-resolved fluorescence or time-resolved fluorescence assay
In DepthDetails ArticlePubMed