BDBM50197840 CHEMBL3914131
SMILES CN1CCN(CC1)c1cccc(n1)C(=O)c1ccc(F)c(O)c1
InChI Key InChIKey=JSMLPWJQBCDATP-UHFFFAOYSA-N
Data  1 KI
  Tab Delimited (TSV)   2D SDfile   Computed 3D by Vconf -m prep SDfile
Find this compound or compounds like it in BindingDB:
Activity Spreadsheet -- Enzyme Inhibition Constant Data from BindingDB
Found 1 hit for monomerid = 50197840
Target17-beta-hydroxysteroid dehydrogenase 14(Homo sapiens (Human))
Philipps University Marburg
Curated by ChEMBL
LigandPNGBDBM50197840(CHEMBL3914131)
Affinity DataKi:  190nM. Assay description: Inhibition of N-terminal 6His-tagged human human HSD17B14 expressed in Escherichia coli BL21 (DE3) pLysS using E2 substrate and NAD+ incubated for 2 ...
In DepthDetails ArticlePubMed