BDBM50199362 (9R,12R,15S)-15-benzyl-9-(4-hydroxy-benzyl)-12-isopropyl-6,7,8,9,11,12,14,15,17,18-decahydro-5-oxa-8,11,14,17-tetraaza-benzocyclooctadecene-10,13,16-trione::CHEMBL437326
SMILES CC(C)[C@H]1NC(=O)[C@@H](Cc2ccc(O)cc2)NCCOc2ccccc2\C=C\CNC(=O)[C@H](Cc2ccccc2)NC1=O
InChI Key InChIKey=JAVMKYBLYODMLB-WCWPRPRFSA-N
Data  1 KI
  Tab Delimited (TSV)   2D SDfile   Computed 3D by Vconf -m prep SDfile
Find this compound or compounds like it in BindingDB:
Activity Spreadsheet -- Enzyme Inhibition Constant Data from BindingDB
Found 1 hit for monomerid = 50199362
TargetMotilin receptor(Homo sapiens (Human))
Tranzyme Pharma
Curated by ChEMBL
LigandPNGBDBM50199362((9R,12R,15S)-15-benzyl-9-(4-hydroxy-benzyl)-12-iso...)
Affinity DataKi:  185nM. Assay description: Displacement of [125I]motilin from human MOTR
In DepthDetails ArticlePubMed